Question
collect2.exe: error: ld returned 5 exit status
use stm32cubeide to compile a project, but failed.
error information is "collect2.exe: error: ld returned 5 exit status"
and the fellow error:
please help me to fix this problem,
thank you~~~
use stm32cubeide to compile a project, but failed.
error information is "collect2.exe: error: ld returned 5 exit status"
and the fellow error:
please help me to fix this problem,
thank you~~~
Enter your E-mail address. We'll send you an e-mail with instructions to reset your password.