Visual Studio compile can not find MJPEGWidget.cpp etc
Hi,
Does anyone know how to solve the compile issue below.
Thanks,
Eddy
1>------ Build started: Project: Application, Configuration: Debug Win32 ------
1>Using ImageConvert to generate BitmapDatabase files
1>Creating compile items for all generated source files: ..\..\generated\fonts\src\ApplicationFontProvider.cpp;..\..\generated\fonts\src\FontGetters.cpp;..\..\generated\fonts\src\Font_verdana_10_4bpp.cpp;..\..\generated\fonts\src\Font_verdana_20_4bpp.cpp;..\..\generated\fonts\src\Font_verdana_40_4bpp.cpp;..\..\generated\fonts\src\Kerning_verdana_10_4bpp.cpp;..\..\generated\fonts\src\Kerning_verdana_20_4bpp.cpp;..\..\generated\fonts\src\Kerning_verdana_40_4bpp.cpp;..\..\generated\fonts\src\Table_verdana_10_4bpp.cpp;..\..\generated\fonts\src\Table_verdana_20_4bpp.cpp;..\..\generated\fonts\src\Table_verdana_40_4bpp.cpp;..\..\generated\images\src\BitmapDatabase.cpp;..\..\generated\images\src\__designer\blue_slider_horizontal_medium_indicators_slider_round_***.cpp;..\..\generated\images\src\__designer\blue_slider_horizontal_medium_slider_round_back.cpp;..\..\generated\images\src\__designer\blue_slider_horizontal_medium_slider_round_fill.cpp;..\..\generated\images\src\__designer\blue_textures_carbon_fibre.cpp;..\..\generated\texts\src\LanguageGb.cpp;..\..\generated\texts\src\Texts.cpp;..\..\generated\texts\src\TypedTextDatabase.cpp
1>main.cpp
1>FrontendApplicationBase.cpp
1>JPEGFile.cpp
1>MJPEGReader.cpp
1>MJPEGWidget.cpp
1>StdFileInput.cpp
1>Screen1Presenter.cpp
1>Screen1View.cpp
1>c1xx : fatal error C1083: Cannot open source file: '..\..\widgets\src\MJPEGWidget.cpp': No such file or directory
1>c1xx : fatal error C1083: Cannot open source file: '..\..\widgets\src\JPEGFile.cpp': No such file or directory
1>Screen1ViewBase.cpp
1>c1xx : fatal error C1083: Cannot open source file: '..\StdFileInput.cpp': No such file or directory
1>c1xx : fatal error C1083: Cannot open source file: '..\..\widgets\src\MJPEGReader.cpp': No such file or directory
1>Done building project "Application.vcxproj" -- FAILED.
========== Build: 0 succeeded, 1 failed, 0 up-to-date, 0 skipped ==========
