Inquire about error occurrence when using image in skin folder in "imageProgress" function
hello
Inquire about error occurrence when using image in skin folder in "imageProgress" function
If you select the project folder in the "imageProgress" function, it works normally, but if you select the image in the skin folder, an error occurs.
PC simulation works normally, but an error occurs only in the target board download.
The error message is as below :
compilation terminated.
gcc/Makefile:339: recipe for target 'TouchGFX/build/STM32H735G-DK/TouchGFX/generated/images/src/__designer/image_Blue_ProgressIndicators_fill_tiling_progress_indicator_fill_striped_normal_horizontal.o' failed
make[2]: *** [TouchGFX/build/STM32H735G-DK/TouchGFX/generated/images/src/__designer/image_Blue_ProgressIndicators_fill_tiling_progress_indicator_fill_striped_normal_horizontal.o] Error 1
make[2]: *** Waiting for unfinished jobs....
gcc/Makefile:289: recipe for target 'generate_assets' failed
make[1]: *** [generate_assets] Error 2
../gcc/Makefile:49: recipe for target 'all' failed
make: *** [all] Error 2
thank!
