cubeIDE1.3
Based on STM32H743I EVAL2, cubeIDE1.3 always displays the following when compiling the Touchgfx4.13 code generated by CubeMX5.6:
^~~~~~~~~~~~~~~~~~~~~~~~~~~~~
compilation terminated.
make: *** [TouchGFX/touchgfx/os/subdir.mk:23: TouchGFX/touchgfx/os/OSWrappers_cmsis.o] Error 1
../TouchGFX/touchgfx/framework/source/touchgfx/widgets/canvas/AbstractPainter.cpp:16:10: fatal error: touchgfx/widgets/canvas/AbstractPainter.hpp: No such file or directory
#include <touchgfx/widgets/canvas/AbstractPainter.hpp>
^~~~~~~~~~~~~~~~~~~~~~~~~~~~~~~~~~~~~~~~~~~~~
compilation terminated.
make: *** [TouchGFX/touchgfx/framework/source/touchgfx/widgets/canvas/subdir.mk:132: TouchGFX/touchgfx/framework/source/touchgfx/widgets/canvas/AbstractPainter.o] Error 1
../TouchGFX/touchgfx/framework/source/touchgfx/widgets/canvas/AbstractPainterABGR2222.cpp:16:10: fatal error: touchgfx/widgets/canvas/AbstractPainterABGR2222.hpp: No such file or directory
#include <touchgfx/widgets/canvas/AbstractPainterABGR2222.hpp>
^~~~~~~~~~~~~~~~~~~~~~~~~~~~~~~~~~~~~~~~~~~~~~~~~~~~~
compilation terminated.
make: *** [TouchGFX/touchgfx/framework/source/touchgfx/widgets/canvas/subdir.mk:134: TouchGFX/touchgfx/framework/source/touchgfx/widgets/canvas/AbstractPainterABGR2222.o] Error 1
"make -j4 all" terminated with exit code 2. Build might be incomplete.
10:29:07 Build Failed. 9 errors, 0 warnings. (took 48s.93ms)
