Question
Cannot run target or simulator
Hello, I cannot run target nor run the simulator eventhough I can debug the solution file from VisualStudio. There are no errors in the VisualStudio. So what might be the reason behind that? Detailed Log is showing tons of errors and failures.
Here is the TouchGFX Designer Output: (It is too long so I put last lines of it.)
gui/include/gui/model/Model.hpp:15:19: error: '_int16' has not been declared
void saveHour(_int16 saveHour)
^~~~~~
gui/include/gui/model/Model.hpp:20:21: error: '_int16' has not been declared
void SaveMinute(_int16 saveMinute)
^~~~~~
gui/include/gui/model/Model.hpp:24:5: error: '_int16' does not name a type
_int16 getHour()
^~~~~~
gui/include/gui/model/Model.hpp:29:5: error: '_int16' does not name a type
_int16 getMinute()
^~~~~~
gui/include/gui/model/Model.hpp:37:5: error: '_int16' does not name a type
_int16 hour;
^~~~~~
gui/include/gui/model/Model.hpp:38:5: error: '_int16' does not name a type
_int16 minute;
^~~~~~
gui/include/gui/model/Model.hpp: In member function 'void Model::saveHour(int)':
gui/include/gui/model/Model.hpp:17:9: error: 'hour' was not declared in this scope
hour = saveHour;
^~~~
gui/include/gui/model/Model.hpp: In member function 'void Model::SaveMinute(int)':
gui/include/gui/model/Model.hpp:22:9: error: 'minute' was not declared in this scope
minute = saveMinute;
^~~~~~
In file included from generated/gui_generated/include/gui_generated/screenclock1_screen/screenClock1ViewBase.hpp:9:0,
from gui/include/gui/screenclock1_screen/screenClock1View.hpp:4,
from gui/src/screenclock1_screen/screenClock1Presenter.cpp:1:
gui/include/gui/screenclock1_screen/screenClock1Presenter.hpp: In member function 'int16_t screenClock1Presenter::getHour()':
gui/include/gui/screenclock1_screen/screenClock1Presenter.hpp:40:23: error: 'class Model' has no member named 'getHour'; did you mean 'saveHour'?
return model->getHour();
^~~~~~~
gui/include/gui/screenclock1_screen/screenClock1Presenter.hpp: In member function 'int16_t screenClock1Presenter::getMinute()':
gui/include/gui/screenclock1_screen/screenClock1Presenter.hpp:44:23: error: 'class Model' has no member named 'getMinute'; did you mean 'SaveMinute'?
return model->getMinute();
^~~~~~~~~
make[2]: *** [build/MINGW32_NT-6.2/gui/src/screenclock1_screen/screenClock1View.o] Error 1
simulator/gcc/Makefile:214: recipe for target 'build/MINGW32_NT-6.2/gui/src/screenclock1_screen/screenClock1View.o' failed
make[2]: *** [build/MINGW32_NT-6.2/gui/src/screenclock1_screen/screenClock1Presenter.o] Error 1
simulator/gcc/Makefile:214: recipe for target 'build/MINGW32_NT-6.2/gui/src/screenclock1_screen/screenClock1Presenter.o' failed
simulator/gcc/Makefile:176: recipe for target 'generate_assets' failed
make[1]: *** [generate_assets] Error 2
simulator/gcc/Makefile:37: recipe for target 'all' failed
make: *** [all] Error 2
Failed
FailedThe thing is the places where log says "error" or "fail" there is no problem in the VS project.
